........................................................................ [ 19%]
....................................................F................... [ 39%]
.F.............................sFF............F......................... [ 58%]
...........................................F..........F...F..FFF........ [ 78%]
........................................................................ [ 97%]
........                                                                 [100%]
=========================== short test summary info ===========================
FAILED tests/test_p0_backup.py::test_sqlite_backup_and_restore_with_media - P...
FAILED tests/test_p0_p4_completion_v89.py::test_restore_replaces_directory_atomically_and_preserves_previous
FAILED tests/test_release_native_v814.py::test_sftp_immutable_release_atomic_switch_rollback_and_verification
FAILED tests/test_release_native_v814.py::test_sftp_probe_failure_restores_previous_release
FAILED tests/test_release_v813.py::test_agent_rejects_invalid_signature_and_paths
FAILED tests/test_theme_registry.py::test_trade_pro_builds_real_site - assert...
FAILED tests/test_v818_pg_recovery.py::test_pg_env_never_passes_secret_in_commands
FAILED tests/test_v818_pg_recovery.py::test_traversal_and_symlink_refused - O...
FAILED tests/test_v818_sqlite_pg_transfer.py::test_dependent_tables_transferred_with_hashes
FAILED tests/test_v818_sqlite_pg_transfer.py::test_target_nonempty_refuses_all_changes
FAILED tests/test_v818_sqlite_pg_transfer.py::test_migration_guard_and_schema_mismatch
11 failed, 356 passed, 1 skipped in 285.02s (0:04:45)
